zephyr/master: daily build zephyr-kernel-1.7.99-170422-ca44116 Failure


donotreply@...
 

zephyr/master: daily build zephyr-kernel-1.7.99-170422-ca44116 Failure



job zephyr-sanity build number 748 failed
see: https://jenkins.zephyrproject.org/job/zephyr-sanity/748/

make[2]: Target `all' not remade because of errors.
make[2]: Leaving directory `/w/workspace/zephyr-sanity'
make[1]: *** [all] Error 2
make[1]: Leaving directory `/w/workspace/zephyr-sanity/samples/bluetooth/central_hr'
Generating LALR tables
------------------sanity-out/tinytile/samples/bluetooth/central_hr/test/build.log-------------------
qemu_x86 tests/net/trickle/test FAILED: timeout
------------------------sanity-out/qemu_x86/tests/net/trickle/test/qemu.log-------------------------
***** BOOTING ZEPHYR OS v1.7.99 - BUILD: Apr 23 2017 07:58:46 *****
ASSERTION FAIL [num_events > 0] @ /w/workspace/zephyr-sanity/kernel/poll.c:177:
zero events
------------------------sanity-out/qemu_x86/tests/net/trickle/test/qemu.log-------------------------
qemu_x86 tests/net/lib/zoap/test FAILED: timeout
------------------------sanity-out/qemu_x86/tests/net/lib/zoap/test/qemu.log------------------------
***** BOOTING ZEPHYR OS v1.7.99 - BUILD: Apr 23 2017 07:59:04 *****
ASSERTION FAIL [num_events > 0] @ /w/workspace/zephyr-sanity/kernel/poll.c:177:
zero events
------------------------sanity-out/qemu_x86/tests/net/lib/zoap/test/qemu.log------------------------
qemu_x86 tests/net/lib/dns_packet/test FAILED: timeout
---------------------sanity-out/qemu_x86/tests/net/lib/dns_packet/test/qemu.log---------------------
***** BOOTING ZEPHYR OS v1.7.99 - BUILD: Apr 23 2017 07:58:48 *****
ASSERTION FAIL [num_events > 0] @ /w/workspace/zephyr-sanity/kernel/poll.c:177:
zero events
---------------------sanity-out/qemu_x86/tests/net/lib/dns_packet/test/qemu.log---------------------
0 of 166 tests passed with 0 warnings in 11087 seconds
Extra environment setting:
CONFIG_ASSERT=y
CONFIG_DEBUG=y
Build step 'Execute shell' marked build as failure


job zephyr-sanity build number 747 failed
see: https://jenkins.zephyrproject.org/job/zephyr-sanity/747/

***** BOOTING ZEPHYR OS v1.7.99 - BUILD: Apr 23 2017 02:35:58 *****
tc_start() - Test kernel CPU and thread routines
Initializing kernel objects
Testing interrupt locking and unlocking
Testing irq_disable() and irq_enable()
Testing some kernel context routines
Testing k_current_get() from an ISR and task
Testing k_is_in_isr() from an ISR
Testing k_is_in_isr() from a preemtible thread
Spawning a thread from a task
Thread to test k_current_get() and k_is_in_isr()
Thread to test k_yield()
Testing k_busy_wait()
Thread busy waiting for 20000 usecs
Thread busy waiting completed
Testing k_sleep()
thread sleeping for 50 milliseconds
thread back from sleep
Testing k_thread_spawn() without cancellation
thread (q order: 2, t/o: 500) is running
got thread (q order: 2, t/o: 500) as expected
thread (q order: 3, t/o: 750) is running
got thread (q order: 3, t/o: 750) as expected
thread (q order: 0, t/o: 1000) is running
---------------------sanity-out/qemu_riscv32/tests/kernel/context/test/qemu.log---------------------
0 of 29 tests passed with 0 warnings in 97 seconds
Extra environment setting:
CONFIG_DEBUG=y
Build step 'Execute shell' marked build as failure


job zephyr-sanity build number 746 failed
see: https://jenkins.zephyrproject.org/job/zephyr-sanity/746/

make[2]: *** [sub-make] Error 2
make[2]: Target `all' not remade because of errors.
make[2]: Leaving directory `/w/workspace/zephyr-sanity'
make[1]: *** [all] Error 2
make[1]: Leaving directory `/w/workspace/zephyr-sanity/samples/bluetooth/peripheral_csc'
-------------sanity-out/qemu_cortex_m3/samples/bluetooth/peripheral_csc/test/build.log--------------
qemu_x86 tests/net/utils/test FAILED: timeout
Generating LALR tables
-------------------------sanity-out/qemu_x86/tests/net/utils/test/qemu.log--------------------------
***** BOOTING ZEPHYR OS v1.7.99 - BUILD: Apr 23 2017 06:25:58 *****
ASSERTION FAIL [num_events > 0] @ /w/workspace/zephyr-sanity/kernel/poll.c:177:
zero events
-------------------------sanity-out/qemu_x86/tests/net/utils/test/qemu.log--------------------------
qemu_x86 tests/net/lib/http_header_fields/test FAILED: timeout
-----------------sanity-out/qemu_x86/tests/net/lib/http_header_fields/test/qemu.log-----------------
***** BOOTING ZEPHYR OS v1.7.99 - BUILD: Apr 23 2017 06:26:00 *****
ASSERTION FAIL [num_events > 0] @ /w/workspace/zephyr-sanity/kernel/poll.c:177:
zero events
-----------------sanity-out/qemu_x86/tests/net/lib/http_header_fields/test/qemu.log-----------------
qemu_x86 tests/net/lib/dns_packet/test FAILED: timeout
---------------------sanity-out/qemu_x86/tests/net/lib/dns_packet/test/qemu.log---------------------
***** BOOTING ZEPHYR OS v1.7.99 - BUILD: Apr 23 2017 06:25:35 *****
ASSERTION FAIL [num_events > 0] @ /w/workspace/zephyr-sanity/kernel/poll.c:177:
zero events
---------------------sanity-out/qemu_x86/tests/net/lib/dns_packet/test/qemu.log---------------------
0 of 139 tests passed with 0 warnings in 10966 seconds
Extra environment setting:
CONFIG_ASSERT=y
Build step 'Execute shell' marked build as failure