zephyr/master: daily build zephyr-kernel-1.7.99-170424-35a48de Failure


donotreply@...
 

zephyr/master: daily build zephyr-kernel-1.7.99-170424-35a48de Failure



job zephyr-sanity build number 756 failed
see: https://jenkins.zephyrproject.org/job/zephyr-sanity/756/

------------------------sanity-out/qemu_x86/tests/net/lib/zoap/test/qemu.log------------------------
***** BOOTING ZEPHYR OS v1.7.99 - BUILD: Apr 25 2017 08:20:20 *****
ASSERTION FAIL [num_events > 0] @ /w/workspace/zephyr-sanity/kernel/poll.c:177:
zero events
------------------------sanity-out/qemu_x86/tests/net/lib/zoap/test/qemu.log------------------------
qemu_x86 tests/net/utils/test FAILED: timeout
Generating LALR tables
-------------------------sanity-out/qemu_x86/tests/net/utils/test/qemu.log--------------------------
***** BOOTING ZEPHYR OS v1.7.99 - BUILD: Apr 25 2017 08:20:20 *****
ASSERTION FAIL [num_events > 0] @ /w/workspace/zephyr-sanity/kernel/poll.c:177:
zero events
-------------------------sanity-out/qemu_x86/tests/net/utils/test/qemu.log--------------------------
qemu_x86 tests/net/trickle/test FAILED: timeout
------------------------sanity-out/qemu_x86/tests/net/trickle/test/qemu.log-------------------------
***** BOOTING ZEPHYR OS v1.7.99 - BUILD: Apr 25 2017 08:20:20 *****
ASSERTION FAIL [num_events > 0] @ /w/workspace/zephyr-sanity/kernel/poll.c:177:
zero events
------------------------sanity-out/qemu_x86/tests/net/trickle/test/qemu.log-------------------------
qemu_x86 tests/net/lib/dns_packet/test FAILED: timeout
---------------------sanity-out/qemu_x86/tests/net/lib/dns_packet/test/qemu.log---------------------
***** BOOTING ZEPHYR OS v1.7.99 - BUILD: Apr 25 2017 08:17:50 *****
ASSERTION FAIL [num_events > 0] @ /w/workspace/zephyr-sanity/kernel/poll.c:177:
zero events
---------------------sanity-out/qemu_x86/tests/net/lib/dns_packet/test/qemu.log---------------------
1 of 165 tests passed with 0 warnings in 10863 seconds
Extra environment setting:
CONFIG_ASSERT=y
CONFIG_DEBUG=y
Build step 'Execute shell' marked build as failure


job zephyr-sanity build number 755 failed
see: https://jenkins.zephyrproject.org/job/zephyr-sanity/755/

LD drivers/built-in.o
CC kernel/stack.o
CC kernel/sys_clock.o
CC kernel/system_work_q.o
CC kernel/thread.o
CC kernel/thread_abort.o
CC kernel/timer.o
CC kernel/work_q.o
LD kernel/built-in.o
AR kernel/lib.a
AR libzephyr.a
LINK zephyr.lnk
/opt/zephyr-sdk-0.9/sysroots/x86_64-pokysdk-linux/usr/libexec/i586-zephyr-elf/gcc/i586-zephyr-elf/6.2.0/real-ld: zephyr_prebuilt.elf section `rodata' will not fit in region `RAM'
/opt/zephyr-sdk-0.9/sysroots/x86_64-pokysdk-linux/usr/libexec/i586-zephyr-elf/gcc/i586-zephyr-elf/6.2.0/real-ld: region `RAM' overflowed by 59648 bytes
collect2: error: ld returned 1 exit status
make[3]: *** [zephyr_prebuilt.elf] Error 1
make[3]: Target `all' not remade because of errors.
make[3]: Leaving directory `/w/workspace/zephyr-sanity/sanity-out/qemu_x86/tests/net/all/test'
make[2]: *** [sub-make] Error 2
make[2]: Target `all' not remade because of errors.
make[2]: Leaving directory `/w/workspace/zephyr-sanity'
make[1]: *** [all] Error 2
make[1]: Leaving directory `/w/workspace/zephyr-sanity/tests/net/all'
Generating LALR tables
--------------------------sanity-out/qemu_x86/tests/net/all/test/build.log--------------------------
1 of 28 tests passed with 0 warnings in 73 seconds
Extra environment setting:
CONFIG_DEBUG=y
Build step 'Execute shell' marked build as failure


job zephyr-sanity build number 754 failed
see: https://jenkins.zephyrproject.org/job/zephyr-sanity/754/

make[2]: *** [sub-make] Error 2
make[2]: Target `all' not remade because of errors.
make[2]: Leaving directory `/w/workspace/zephyr-sanity'
make[1]: *** [all] Error 2
make[1]: Leaving directory `/w/workspace/zephyr-sanity/samples/bluetooth/central_hr'
------------------sanity-out/qemu_x86/samples/bluetooth/central_hr/test/build.log-------------------
qemu_x86 tests/net/utils/test FAILED: timeout
-------------------------sanity-out/qemu_x86/tests/net/utils/test/qemu.log--------------------------
Generating LALR tables
***** BOOTING ZEPHYR OS v1.7.99 - BUILD: Apr 25 2017 07:55:20 *****
ASSERTION FAIL [num_events > 0] @ /w/workspace/zephyr-sanity/kernel/poll.c:177:
zero events
-------------------------sanity-out/qemu_x86/tests/net/utils/test/qemu.log--------------------------
qemu_x86 tests/net/lib/mqtt_packet/test FAILED: timeout
--------------------sanity-out/qemu_x86/tests/net/lib/mqtt_packet/test/qemu.log---------------------
***** BOOTING ZEPHYR OS v1.7.99 - BUILD: Apr 25 2017 07:55:36 *****
ASSERTION FAIL [num_events > 0] @ /w/workspace/zephyr-sanity/kernel/poll.c:177:
zero events
--------------------sanity-out/qemu_x86/tests/net/lib/mqtt_packet/test/qemu.log---------------------
qemu_x86 tests/net/lib/dns_packet/test FAILED: timeout
---------------------sanity-out/qemu_x86/tests/net/lib/dns_packet/test/qemu.log---------------------
***** BOOTING ZEPHYR OS v1.7.99 - BUILD: Apr 25 2017 07:55:17 *****
ASSERTION FAIL [num_events > 0] @ /w/workspace/zephyr-sanity/kernel/poll.c:177:
zero events
---------------------sanity-out/qemu_x86/tests/net/lib/dns_packet/test/qemu.log---------------------
0 of 139 tests passed with 0 warnings in 11028 seconds
Extra environment setting:
CONFIG_ASSERT=y
Build step 'Execute shell' marked build as failure