zephyr/master: daily build zephyr-kernel-1.7.99-170426-4792f36 Failure


donotreply@...
 

zephyr/master: daily build zephyr-kernel-1.7.99-170426-4792f36 Failure



job zephyr-sanity build number 764 failed
see: https://jenkins.zephyrproject.org/job/zephyr-sanity/764/

qemu_x86 tests/net/icmpv6/test FAILED: timeout
-------------------------sanity-out/qemu_x86/tests/net/icmpv6/test/qemu.log-------------------------
***** BOOTING ZEPHYR OS v1.7.99 - BUILD: Apr 27 2017 07:23:31 *****
ASSERTION FAIL [num_events > 0] @ /w/workspace/zephyr-sanity/kernel/poll.c:177:
zero events
-------------------------sanity-out/qemu_x86/tests/net/icmpv6/test/qemu.log-------------------------
qemu_x86 tests/net/lib/mqtt_packet/test FAILED: timeout
--------------------sanity-out/qemu_x86/tests/net/lib/mqtt_packet/test/qemu.log---------------------
***** BOOTING ZEPHYR OS v1.7.99 - BUILD: Apr 27 2017 07:24:08 *****
ASSERTION FAIL [num_events > 0] @ /w/workspace/zephyr-sanity/kernel/poll.c:177:
zero events
--------------------sanity-out/qemu_x86/tests/net/lib/mqtt_packet/test/qemu.log---------------------
qemu_x86 tests/net/lib/http_header_fields/test FAILED: timeout
-----------------sanity-out/qemu_x86/tests/net/lib/http_header_fields/test/qemu.log-----------------
***** BOOTING ZEPHYR OS v1.7.99 - BUILD: Apr 27 2017 07:24:09 *****
ASSERTION FAIL [num_events > 0] @ /w/workspace/zephyr-sanity/kernel/poll.c:177:
zero events
-----------------sanity-out/qemu_x86/tests/net/lib/http_header_fields/test/qemu.log-----------------
qemu_x86 tests/net/lib/dns_packet/test FAILED: timeout
---------------------sanity-out/qemu_x86/tests/net/lib/dns_packet/test/qemu.log---------------------
***** BOOTING ZEPHYR OS v1.7.99 - BUILD: Apr 27 2017 07:21:57 *****
ASSERTION FAIL [num_events > 0] @ /w/workspace/zephyr-sanity/kernel/poll.c:177:
zero events
---------------------sanity-out/qemu_x86/tests/net/lib/dns_packet/test/qemu.log---------------------
0 of 166 tests passed with 0 warnings in 10842 seconds
Extra environment setting:
CONFIG_ASSERT=y
CONFIG_DEBUG=y
Build step 'Execute shell' marked build as failure


job zephyr-sanity build number 763 failed
see: https://jenkins.zephyrproject.org/job/zephyr-sanity/763/

TR =0000 00000000 0000ffff 00008b00 DPL=0 TSS32-busy
GDT= 00100070 00000017
IDT= 00102d68 000007ff
CR0=0000003f CR2=00000000 CR3=00000000 CR4=00000000
DR0=00000000 DR1=00000000 DR2=00000000 DR3=00000000
DR6=ffff0ff0 DR7=00000400
CCS=00000000 CCD=00000070 CCO=ADDB
EFER=0000000000000000
FCW=037f FSW=0000 [ST=0] FTW=00 MXCSR=00001f80
FPR0=0000000000000000 0000 FPR1=0000000000000000 0000
FPR2=0000000000000000 0000 FPR3=0000000000000000 0000
FPR4=0000000000000000 0000 FPR5=0000000000000000 0000
FPR6=0000000000000000 0000 FPR7=0000000000000000 0000
XMM00=00000000000000000000000000000000 XMM01=00000000000000000000000000000000
XMM02=00000000000000000000000000000000 XMM03=00000000000000000000000000000000
XMM04=00000000000000000000000000000000 XMM05=00000000000000000000000000000000
XMM06=00000000000000000000000000000000 XMM07=00000000000000000000000000000000
make[3]: *** [run] Aborted (core dumped)
make[3]: Leaving directory `/w/workspace/zephyr-sanity/sanity-out/qemu_x86/tests/kernel/test_sleep/test'
make[2]: *** [sub-make] Error 2
make[2]: Target `run' not remade because of errors.
make[2]: Leaving directory `/w/workspace/zephyr-sanity'
make[1]: *** [run] Error 2
make[1]: Leaving directory `/w/workspace/zephyr-sanity/tests/kernel/test_sleep'
----------------------sanity-out/qemu_x86/tests/kernel/test_sleep/test/run.log----------------------
0 of 29 tests passed with 0 warnings in 66 seconds
Extra environment setting:
CONFIG_DEBUG=y
Build step 'Execute shell' marked build as failure


job zephyr-sanity build number 762 failed
see: https://jenkins.zephyrproject.org/job/zephyr-sanity/762/

qemu_x86 tests/net/neighbor/test FAILED: timeout
------------------------sanity-out/qemu_x86/tests/net/neighbor/test/qemu.log------------------------
***** BOOTING ZEPHYR OS v1.7.99 - BUILD: Apr 27 2017 07:19:15 *****
ASSERTION FAIL [num_events > 0] @ /w/workspace/zephyr-sanity/kernel/poll.c:177:
zero events
Generating LALR tables
------------------------sanity-out/qemu_x86/tests/net/neighbor/test/qemu.log------------------------
qemu_x86 tests/net/icmpv6/test FAILED: timeout
-------------------------sanity-out/qemu_x86/tests/net/icmpv6/test/qemu.log-------------------------
***** BOOTING ZEPHYR OS v1.7.99 - BUILD: Apr 27 2017 07:19:39 *****
ASSERTION FAIL [num_events > 0] @ /w/workspace/zephyr-sanity/kernel/poll.c:177:
zero events
-------------------------sanity-out/qemu_x86/tests/net/icmpv6/test/qemu.log-------------------------
qemu_x86 tests/net/lib/zoap/test FAILED: timeout
------------------------sanity-out/qemu_x86/tests/net/lib/zoap/test/qemu.log------------------------
***** BOOTING ZEPHYR OS v1.7.99 - BUILD: Apr 27 2017 07:19:40 *****
ASSERTION FAIL [num_events > 0] @ /w/workspace/zephyr-sanity/kernel/poll.c:177:
zero events
------------------------sanity-out/qemu_x86/tests/net/lib/zoap/test/qemu.log------------------------
qemu_x86 tests/net/lib/dns_packet/test FAILED: timeout
---------------------sanity-out/qemu_x86/tests/net/lib/dns_packet/test/qemu.log---------------------
***** BOOTING ZEPHYR OS v1.7.99 - BUILD: Apr 27 2017 07:19:39 *****
ASSERTION FAIL [num_events > 0] @ /w/workspace/zephyr-sanity/kernel/poll.c:177:
zero events
---------------------sanity-out/qemu_x86/tests/net/lib/dns_packet/test/qemu.log---------------------
0 of 140 tests passed with 0 warnings in 11034 seconds
Extra environment setting:
CONFIG_ASSERT=y
Build step 'Execute shell' marked build as failure


job zephyr-sanity build number 761 failed
see: https://jenkins.zephyrproject.org/job/zephyr-sanity/761/

^~~
/w/workspace/zephyr-sanity/drivers/watchdog/wdt_sam.c:43:5: error: request for member ‘WDT_MR’ in something not a structure or union
wdt->WDT_MR |= WDT_MR_WDDIS;
^~
/w/workspace/zephyr-sanity/drivers/watchdog/wdt_sam.c:43:17: error: ‘WDT_MR_WDDIS’ undeclared (first use in this function)
wdt->WDT_MR |= WDT_MR_WDDIS;
^~~~~~~~~~~~
/w/workspace/zephyr-sanity/drivers/watchdog/wdt_sam.c:43:17: note: each undeclared identifier is reported only once for each function it appears in
/w/workspace/zephyr-sanity/drivers/watchdog/wdt_sam.c: At top level:
/w/workspace/zephyr-sanity/drivers/watchdog/wdt_sam.c:88:10: error: ‘WDT’ undeclared here (not in a function)
.regs = WDT
^~~
make[5]: *** [drivers/watchdog/wdt_sam.o] Error 1
make[5]: Target `__build' not remade because of errors.
make[4]: *** [drivers/watchdog] Error 2
make[4]: Target `__build' not remade because of errors.
make[3]: *** [drivers] Error 2
AR kernel/lib.a
make[3]: Target `all' not remade because of errors.
make[3]: Leaving directory `/w/workspace/zephyr-sanity/sanity-out/arduino_due/tests/drivers/build_all/test_build_drivers'
make[2]: *** [sub-make] Error 2
make[2]: Target `all' not remade because of errors.
make[2]: Leaving directory `/w/workspace/zephyr-sanity'
make[1]: *** [all] Error 2
make[1]: Leaving directory `/w/workspace/zephyr-sanity/tests/drivers/build_all'
------------sanity-out/arduino_due/tests/drivers/build_all/test_build_drivers/build.log-------------
0 of 1 tests passed with 0 warnings in 3 seconds
Generating LALR tables
Build step 'Execute shell' marked build as failure