Date   
[ master ] Build FAILED for zephyrproject-rtos/test_results ( tests: reel board test results Testing CI system, run tests on hardware reel board v1 Signed-off-by: Maksim Masalski <maksim.masalski@intel.com> ) on Shippable.com 6 messages #builds By Shippable.com ·
[ master ] Build TIMEOUT for zephyrproject-rtos/ci-test ( ci: Update sdk to 0.11.3 Update sdk to 0.11.3 release and update docker image to get that SDK version. Signed-off-by: Kumar Gala <kumar.gala@linaro.org> ) on Shippable.com 14 messages #builds By Shippable.com ·
[ master ] Build UNSTABLE for zephyrproject-rtos/test_results ( tests: reel board test results Testing CI system, run tests on hardware reel board v1 Signed-off-by: Maksim Masalski <maksim.masalski@intel.com> ) on Shippable.com #builds By Shippable.com ·
[ master ] Build UNSTABLE for zephyrproject-rtos/test_results ( tests: reel board test results Testing CI system, run tests on hardware reel board v1 Signed-off-by: Maksim Masalski <maksim.masalski@intel.com> ) on Shippable.com #builds By Shippable.com ·
[ master ] Build UNSTABLE for zephyrproject-rtos/test_results ( tests: reel board test results Testing CI system, run tests on hardware reel board v1 Signed-off-by: Maksim Masalski <maksim.masalski@intel.com> ) on Shippable.com 2 messages #builds By Shippable.com ·
[ master ] Build FAILED for zephyrproject-rtos/test_results ( tests: reel board test results Testing CI system, run tests on hardware reel board v1 Signed-off-by: Maksim Masalski <maksim.masalski@intel.com> ) on Shippable.com #builds By Shippable.com ·
[ master ] Build UNSTABLE for zephyrproject-rtos/test_results ( tests: reel board test results Testing CI system, run tests on hardware reel board v1 Signed-off-by: Maksim Masalski <maksim.masalski@intel.com> ) on Shippable.com #builds By Shippable.com ·
[ master ] Build FAILED for zephyrproject-rtos/test_results ( tests: reel board test results Testing CI system, run tests on hardware reel board v1 Signed-off-by: Maksim Masalski <maksim.masalski@intel.com> ) on Shippable.com #builds By Shippable.com ·
[ master ] Build UNSTABLE for zephyrproject-rtos/test_results ( tests: reel board test results Testing CI system, run tests on hardware reel board v1 Signed-off-by: Maksim Masalski <maksim.masalski@intel.com> ) on Shippable.com #builds By Shippable.com ·
[ master ] Build FAILED for zephyrproject-rtos/test_results ( results: add more results for v2.3.0-rc1 ) on Shippable.com 2 messages #builds By Shippable.com ·
[ master ] Build TIMEOUT for zephyrproject-rtos/ci-test ( bump matrix to 35 See if 35 builders will get this to not timeout. Signed-off-by: Kumar Gala <kumar.gala@linaro.org> ) on Shippable.com 12 messages #builds By Shippable.com ·
[ master ] Build UNSTABLE for zephyrproject-rtos/test_results ( results: add more results for v2.3.0-rc1 ) on Shippable.com #builds By Shippable.com ·
[ master ] Build FAILED for zephyrproject-rtos/test_results ( results: add more results for v2.3.0-rc1 ) on Shippable.com 2 messages #builds By Shippable.com ·
[ master ] Build SUCCEEDED for zephyrproject-rtos/test_results ( results: add more results for v2.3.0-rc1 ) on Shippable.com 3 messages #builds By Shippable.com ·
[ master ] Build CANCELED for zephyrproject-rtos/test_results ( actions: fix merging ) on Shippable.com #builds By Shippable.com ·
[ master ] Build SUCCEEDED for zephyrproject-rtos/test_results ( actions: fix merging ) on Shippable.com 2 messages #builds By Shippable.com ·
[ master ] Build CANCELED for zephyrproject-rtos/ci-test ( bump matrix to 35 See if 35 builders will get this to not timeout. Signed-off-by: Kumar Gala <kumar.gala@linaro.org> ) on Shippable.com 2 messages #builds By Shippable.com ·
[ master ] Build FAILED for zephyrproject-rtos/test_results ( actions: fix merging ) on Shippable.com 2 messages #builds By Shippable.com ·
[ master ] Build TIMEOUT for zephyrproject-rtos/ci-test ( bump matrix to 35 See if 35 builders will get this to not timeout. Signed-off-by: Kumar Gala <kumar.gala@linaro.org> ) on Shippable.com 5 messages #builds By Shippable.com ·
[ master ] Build FAILED for zephyrproject-rtos/test_results ( action: upload report to S3 ) on Shippable.com #builds By Shippable.com ·