Date   
[ master ] Build CANCELED for zephyrproject-rtos/test_results ( add m2gl025_miv platform ) on Shippable.com 3 messages #builds By Shippable.com ·
[ master ] Build SUCCEEDED for zephyrproject-rtos/test_results ( ci: get testcommit from CI prep job Signed-off-by: Anas Nashif ) on Shippable.com #builds By Shippable.com ·
[ master ] Build CANCELED for zephyrproject-rtos/test_results ( ci: get testcommit from CI prep job Signed-off-by: Anas Nashif ) on Shippable.com 3 messages #builds By Shippable.com ·
[ master ] Build SUCCEEDED for zephyrproject-rtos/test_results ( ci: build for runnable targets ) on Shippable.com #builds By Shippable.com ·
[ master ] Build SUCCEEDED for zephyrproject-rtos/test_results ( ci: per target report Signed-off-by: Anas Nashif ) on Shippable.com 6 messages #builds By Shippable.com ·
[ master ] Build SUCCEEDED for zephyrproject-rtos/test_results ( ci: per target report ) on Shippable.com #builds By Shippable.com ·
[ master ] Build TIMEOUT for zephyrproject-rtos/ci-test ( ci: bump to docker image v0.11.6 Signed-off-by: Kumar Gala ) on Shippable.com 17 messages #builds By Shippable.com ·
Build failed for esp By Swapna Bulbule ·
[ master ] Build TIMEOUT for zephyrproject-rtos/ci-test ( bump matrix to 30 See if 30 builders will get this to not timeout. Signed-off-by: Kumar Gala ) on Shippable.com 4 messages #builds By Shippable.com ·
[ master ] Build TIMEOUT for zephyrproject-rtos/ci-test ( ci: bump SDK version to 0.11.2 Signed-off-by: Kumar Gala ) on Shippable.com #builds By Shippable.com ·
[ master ] Build FAILED for zephyrproject-rtos/ci-test ( ci: bump to docker image v0.11.5 Bump to 0.11.5 to get west 0.7.2 Signed-off-by: Kumar Gala ) on Shippable.com #builds By Shippable.com ·
[ master ] Build FAILED for zephyrproject-rtos/ci-test ( ci: bump to docker image v0.11.3 Bump to 0.11.3 to get west 0.7.0 Signed-off-by: Kumar Gala ) on Shippable.com 3 messages #builds By Shippable.com ·
[ master ] Build TIMEOUT for zephyrproject-rtos/ci-test ( ci: bump to docker image v0.11.3 Bump to 0.11.3 to get west 0.7.0 Signed-off-by: Kumar Gala ) on Shippable.com 49 messages #builds By Shippable.com ·
Build Failed for Hello_World By Swapna Bulbule ·
[ master ] Build TIMEOUT for zephyrproject-rtos/ci-test ( ci: bump sdk version to 0.11.1 Signed-off-by: Kumar Gala ) on Shippable.com 4 messages #builds By Shippable.com ·
[ master ] Build FAILED for zephyrproject-rtos/ci-test ( move to new docker: v0.11.1 Signed-off-by: Anas Nashif ) on Shippable.com #builds By Shippable.com ·
[ master ] Build CANCELED for zephyrproject-rtos/ci-test ( move to new docker: v0.11.1 Signed-off-by: Anas Nashif ) on Shippable.com #builds By Shippable.com ·
[ master ] Build TIMEOUT for zephyrproject-rtos/ci-test ( move to new docker: v0.11.1 Signed-off-by: Anas Nashif ) on Shippable.com 2 messages #builds By Shippable.com ·
[ master ] Build TIMEOUT for zephyrproject-rtos/ci-test ( ci: move to 0.11.0 docker image ) on Shippable.com 10 messages #builds By Shippable.com ·
[ master ] Build CANCELED for zephyrproject-rtos/ci-test ( ci: move to 0.11.0 docker image ) on Shippable.com 2 messages #builds By Shippable.com ·