Date   
[ master ] Build TIMEOUT for zephyrproject-rtos/ci-test ( ci: bump to docker image v0.11.6 Signed-off-by: Kumar Gala <kumar.gala@linaro.org> ) on Shippable.com 17 messages #builds By Shippable.com ·
Build failed for esp By Swapna Bulbule ·
[ master ] Build TIMEOUT for zephyrproject-rtos/ci-test ( bump matrix to 30 See if 30 builders will get this to not timeout. Signed-off-by: Kumar Gala <kumar.gala@linaro.org> ) on Shippable.com 4 messages #builds By Shippable.com ·
[ master ] Build TIMEOUT for zephyrproject-rtos/ci-test ( ci: bump SDK version to 0.11.2 Signed-off-by: Kumar Gala <kumar.gala@linaro.org> ) on Shippable.com #builds By Shippable.com ·
[ master ] Build FAILED for zephyrproject-rtos/ci-test ( ci: bump to docker image v0.11.5 Bump to 0.11.5 to get west 0.7.2 Signed-off-by: Kumar Gala <kumar.gala@linaro.org> ) on Shippable.com #builds By Shippable.com ·
[ master ] Build FAILED for zephyrproject-rtos/ci-test ( ci: bump to docker image v0.11.3 Bump to 0.11.3 to get west 0.7.0 Signed-off-by: Kumar Gala <kumar.gala@linaro.org> ) on Shippable.com 3 messages #builds By Shippable.com ·
[ master ] Build TIMEOUT for zephyrproject-rtos/ci-test ( ci: bump to docker image v0.11.3 Bump to 0.11.3 to get west 0.7.0 Signed-off-by: Kumar Gala <kumar.gala@linaro.org> ) on Shippable.com 49 messages #builds By Shippable.com ·
Build Failed for Hello_World By Swapna Bulbule ·
[ master ] Build TIMEOUT for zephyrproject-rtos/ci-test ( ci: bump sdk version to 0.11.1 Signed-off-by: Kumar Gala <kumar.gala@linaro.org> ) on Shippable.com 4 messages #builds By Shippable.com ·
[ master ] Build FAILED for zephyrproject-rtos/ci-test ( move to new docker: v0.11.1 Signed-off-by: Anas Nashif <anas.nashif@intel.com> ) on Shippable.com #builds By Shippable.com ·
[ master ] Build CANCELED for zephyrproject-rtos/ci-test ( move to new docker: v0.11.1 Signed-off-by: Anas Nashif <anas.nashif@intel.com> ) on Shippable.com #builds By Shippable.com ·
[ master ] Build TIMEOUT for zephyrproject-rtos/ci-test ( move to new docker: v0.11.1 Signed-off-by: Anas Nashif <anas.nashif@intel.com> ) on Shippable.com 2 messages #builds By Shippable.com ·
[ master ] Build TIMEOUT for zephyrproject-rtos/ci-test ( ci: move to 0.11.0 docker image ) on Shippable.com 10 messages #builds By Shippable.com ·
[ master ] Build CANCELED for zephyrproject-rtos/ci-test ( ci: move to 0.11.0 docker image ) on Shippable.com 2 messages #builds By Shippable.com ·
[ master ] Build TIMEOUT for zephyrproject-rtos/ci-test ( sanitycheck: run in verbose mode Verbosity is now controlled with -v, not based on terminal being used. Signed-off-by: Anas Nashif <anas.nashif@intel.com> ) on Shippable.com 74 messages #builds By Shippable.com ·
[ master ] Build TIMEOUT for zephyrproject-rtos/ci-test ( use latest docker image Signed-off-by: Anas Nashif <anas.nashif@intel.com> ) on Shippable.com #builds By Shippable.com ·
[ master ] Build FAILED for zephyrproject-rtos/ci-test ( increase minions to 25 ) on Shippable.com 24 messages #builds By Shippable.com ·
[ master ] Build SUCCEEDED for zephyrproject-rtos/ci-test ( increase minions to 25 ) on Shippable.com #builds By Shippable.com ·
[ master ] Build TIMEOUT for zephyrproject-rtos/ci-test ( increase minions to 25 ) on Shippable.com 8 messages #builds By Shippable.com ·
[ master ] Build SUCCEEDED for zephyrproject-rtos/ci-test ( increase minions to 25 ) on Shippable.com 4 messages #builds By Shippable.com ·