Date   
[Still Failing] Zephyr / zephyr-daily #13 (master) #builds By Buildkite ·
[ master ] Build TIMEOUT for zephyrproject-rtos/ci-test ( ci: Update sdk to 0.11.3 Update sdk to 0.11.3 release and update docker image to get that SDK version. Signed-off-by: Kumar Gala ) on Shippable.com 27 messages #builds By Shippable.com ·
[ master ] Build FAILED for zephyrproject-rtos/test_results ( zephyr-v2.3.0-437-gb5764f9902: Intel Master Daily Test Report Intel Zephyr Daily Test Report for the master branch Signed-off-by: Maksim Masalski ) on Shippable.com #builds By Shippable.com ·
[Failed] Zephyr / zephyr-daily #12 (master) #builds By Buildkite ·
[ master ] Build FAILED for zephyrproject-rtos/test_results ( zephyr-v2.3.0-361-gcf72fe8fe9: arc em_starterkit_em9d results em_starterkit_em9d: 142 tests passed, 1 failed, 29 skipped 143 tests executed on platforms, 29 tests were only build samples/posix/eventfd/sample.posix.eventfd failed timeout Signed-off-by: Jingru Wang ) on Shippable.com #builds By Shippable.com ·
[Canceled] Zephyr / zephyr-daily #8 (master) #builds By Buildkite ·
[ master ] Build SUCCEEDED for zephyrproject-rtos/test_results ( zephyr-v2.3.0-641-gb5fb9497b6: stm32 results Non reg result analysis on last run: (verdicts: T/p: Passed, F/f: Failed, t:timeout) tests/kernel/fpu_sharing/float_disable/kernel.fpu_sharing.float_disable.arm, nucleo_l4r5zi (instable: pfpfppppppppppppp) tests/kernel/mem_protect/userspace/kernel.memory_protection.userspace, disco_l475_iot1 (instable: pppppppttpppppppp) Total: 19 test(s) failed out of 1802 tests run 0 regression(s) on stable test Signed-off-by: Erwan Gouriou ) on Shippable.com #builds By Shippable.com ·
[ master ] Build FAILED for zephyrproject-rtos/test_results ( zephyr-v2.3.0-618-ga53c813ac5: stm32 results Non reg result analysis on last run: (verdicts: T/p: Passed, F/f: Failed, t:timeout) samples/subsys/nvs/sample.nvs.basic, disco_l475_iot1 (instable: pttpttptttpttpttt) tests/kernel/mem_protect/userspace/kernel.memory_protection.userspace, nucleo_l4r5zi tests/kernel/timer/timer_api/kernel.timer, nucleo_f103rb tests/net/utils/net.util, nucleo_f429zi tests/net/utils/net.util, nucleo_f746zg tests/posix/common/portability.posix.common.newlib, nucleo_wb55rg Total: 18 test(s) failed out of 1799 tests run 5 regression(s) on stable test Signed-off-by: Erwan Gouriou ) on Shippable.com #builds By Shippable.com ·
[ master ] Build SUCCEEDED for zephyrproject-rtos/test_results ( zephyr-v2.3.0-618-ga53c813ac5: stm32 results Non reg result analysis on last run: (verdicts: T/p: Passed, F/f: Failed, t:timeout) samples/subsys/nvs/sample.nvs.basic, disco_l475_iot1 (instable: pttpttptttpttpttt) tests/kernel/mem_protect/userspace/kernel.memory_protection.userspace, nucleo_l4r5zi tests/kernel/timer/timer_api/kernel.timer, nucleo_f103rb tests/net/utils/net.util, nucleo_f429zi tests/net/utils/net.util, nucleo_f746zg tests/posix/common/portability.posix.common.newlib, nucleo_wb55rg Total: 18 test(s) failed out of 1799 tests run 5 regression(s) on stable test Signed-off-by: Erwan Gouriou ) on Shippable.com #builds By Shippable.com ·
[ master ] Build FAILED for zephyrproject-rtos/test_results ( zephyr-v2.3.0-618-ga53c813ac5: stm32 results Non reg result analysis on last run: (verdicts: T/p: Passed, F/f: Failed, t:timeout) samples/subsys/nvs/sample.nvs.basic, disco_l475_iot1 (instable: pttpttptttpttpttt) tests/kernel/mem_protect/userspace/kernel.memory_protection.userspace, nucleo_l4r5zi tests/kernel/timer/timer_api/kernel.timer, nucleo_f103rb tests/net/utils/net.util, nucleo_f429zi tests/net/utils/net.util, nucleo_f746zg tests/posix/common/portability.posix.common.newlib, nucleo_wb55rg Total: 18 test(s) failed out of 1799 tests run 5 regression(s) on stable test Signed-off-by: Erwan Gouriou ) on Shippable.com #builds By Shippable.com ·
test #builds By Brett Preston ·
[ master ] Build SUCCEEDED for zephyrproject-rtos/test_results ( zephyr-v2.3.0-590-g3f8bdf16f9: stm32 results Non reg result analysis on last run: (verdicts: T/p: Passed, F/f: Failed, t:timeout) tests/subsys/logging/log_immediate/logging.log_immediate.clean_output, disco_l475_iot1 tests/subsys/logging/log_immediate/logging.log_immediate.clean_output, nucleo_f207zg tests/subsys/logging/log_immediate/logging.log_immediate.clean_output, nucleo_f429zi Total: 15 test(s) failed out of 1799 tests run 3 regression(s) on stable test Signed-off-by: Erwan Gouriou ) on Shippable.com #builds By Shippable.com ·
[ master ] Build SUCCEEDED for zephyrproject-rtos/test_results ( zephyr-v2.3.0-562-g979e124e21: stm32 results Non reg result analysis on last run: (verdicts: T/p: Passed, F/f: Failed, t:timeout) tests/drivers/counter/counter_basic_api/drivers.counter, nucleo_f746zg (instable: ppfppppfppppppppp) Total results not available as campaign was run also on non supported boards (removed later) Signed-off-by: Erwan Gouriou ) on Shippable.com #builds By Shippable.com ·
[ master ] Build SUCCEEDED for zephyrproject-rtos/test_results ( zephyr-v2.3.0-520-gba0a791635: stm32 results Non reg result analysis on last run: (verdicts: T/p: Passed, F/f: Failed, t:timeout) samples/subsys/nvs/sample.nvs.basic, disco_l475_iot1 (instable: pttptttpttptttppt) tests/kernel/fatal/kernel.common.stack_protection_arm_fpu_sharing, nucleo_f746zg tests/kernel/mem_protect/userspace/kernel.memory_protection.userspace, disco_l475_iot1 (instable: pttpppppppppppppp) tests/kernel/mem_protect/userspace/kernel.memory_protection.userspace, nucleo_f429zi (instable: ptpppppppppptptpp) tests/kernel/mem_protect/userspace/kernel.memory_protection.userspace, nucleo_l4r5zi tests/kernel/mem_protect/userspace/kernel.memory_protection.userspace, nucleo_wb55rg tests/subsys/logging/log_immediate/logging.log_immediate.clean_output, nucleo_f207zg Total: 14 test(s) failed out of 1566 tests run 4 regression(s) on stable test Signed-off-by: Erwan Gouriou ) on Shippable.com # By Shippable.com ·
[ master ] Build SUCCEEDED for zephyrproject-rtos/test_results ( test commit of daily results from the master ) on Shippable.com #builds By Shippable.com ·
[ master ] Build SUCCEEDED for zephyrproject-rtos/test_results ( zephyr-v2.3.0-437-gb5764f9902: stm32 results Non reg result analysis on last run: (verdicts: T/p: Passed, F/f: Failed, t:timeout) Total: 16 test(s) failed out of 1522 tests run 0 regression(s) on stable test Signed-off-by: Erwan Gouriou ) on Shippable.com 2 messages #builds By Shippable.com ·
[ master ] Build FAILED for zephyrproject-rtos/test_results ( action: test trilom/file-changes-action use trilom/file-changes-action to check for changed files. Signed-off-by: Anas Nashif ) on Shippable.com #builds By Shippable.com ·
[ master ] Build SUCCEEDED for zephyrproject-rtos/test_results ( action: test trilom/file-changes-action use trilom/file-changes-action to check for changed files. Signed-off-by: Anas Nashif ) on Shippable.com #builds By Shippable.com ·
[ master ] Build SUCCEEDED for zephyrproject-rtos/test_results ( zephyr-v2.3.0-361-gcf72fe8fe9: stm32 results Non reg result analysis on last run: (verdicts: T/p: Passed, F/f: Failed, t:timeout) samples/subsys/nvs/sample.nvs.basic, nucleo_l4r5zi (instable: pptptttttpppttttt) tests/subsys/logging/log_immediate/logging.log_immediate.clean_output, nucleo_f207zg tests/subsys/logging/log_immediate/logging.log_immediate.clean_output, nucleo_f429zi (instable: ppppptpppppptppppp) Total: 19 test(s) failed out of 1522 tests run 1 regression(s) on stable test Signed-off-by: Erwan Gouriou ) on Shippable.com 2 messages #builds By Shippable.com ·
[ master ] Build SUCCEEDED for zephyrproject-rtos/test_results ( cleanup: Do not upload sanitycheck*.xml files Those files are not needed. Signed-off-by: Anas Nashif ) on Shippable.com #builds By Shippable.com ·