Date   
[ master ] Build FAILED for zephyrproject-rtos/test_results ( tests: reel board test results Testing CI system, run tests on hardware reel board v1 Signed-off-by: Maksim Masalski ) on Shippable.com #builds By Shippable.com ·
[ master ] Build UNSTABLE for zephyrproject-rtos/test_results ( tests: reel board test results Testing CI system, run tests on hardware reel board v1 Signed-off-by: Maksim Masalski ) on Shippable.com #builds By Shippable.com ·
[ master ] Build FAILED for zephyrproject-rtos/test_results ( tests: reel board test results Testing CI system, run tests on hardware reel board v1 Signed-off-by: Maksim Masalski ) on Shippable.com #builds By Shippable.com ·
[ master ] Build UNSTABLE for zephyrproject-rtos/test_results ( tests: reel board test results Testing CI system, run tests on hardware reel board v1 Signed-off-by: Maksim Masalski ) on Shippable.com #builds By Shippable.com ·
[ master ] Build FAILED for zephyrproject-rtos/test_results ( results: add more results for v2.3.0-rc1 ) on Shippable.com 2 messages #builds By Shippable.com ·
[ master ] Build TIMEOUT for zephyrproject-rtos/ci-test ( bump matrix to 35 See if 35 builders will get this to not timeout. Signed-off-by: Kumar Gala ) on Shippable.com 12 messages #builds By Shippable.com ·
[ master ] Build UNSTABLE for zephyrproject-rtos/test_results ( results: add more results for v2.3.0-rc1 ) on Shippable.com #builds By Shippable.com ·
[ master ] Build FAILED for zephyrproject-rtos/test_results ( results: add more results for v2.3.0-rc1 ) on Shippable.com 2 messages #builds By Shippable.com ·
[ master ] Build SUCCEEDED for zephyrproject-rtos/test_results ( results: add more results for v2.3.0-rc1 ) on Shippable.com 3 messages #builds By Shippable.com ·
[ master ] Build CANCELED for zephyrproject-rtos/test_results ( actions: fix merging ) on Shippable.com #builds By Shippable.com ·
[ master ] Build SUCCEEDED for zephyrproject-rtos/test_results ( actions: fix merging ) on Shippable.com 2 messages #builds By Shippable.com ·
[ master ] Build CANCELED for zephyrproject-rtos/ci-test ( bump matrix to 35 See if 35 builders will get this to not timeout. Signed-off-by: Kumar Gala ) on Shippable.com 2 messages #builds By Shippable.com ·
[ master ] Build FAILED for zephyrproject-rtos/test_results ( actions: fix merging ) on Shippable.com 2 messages #builds By Shippable.com ·
[ master ] Build TIMEOUT for zephyrproject-rtos/ci-test ( bump matrix to 35 See if 35 builders will get this to not timeout. Signed-off-by: Kumar Gala ) on Shippable.com 5 messages #builds By Shippable.com ·
[ master ] Build FAILED for zephyrproject-rtos/test_results ( action: upload report to S3 ) on Shippable.com #builds By Shippable.com ·
[ master ] Build FAILED for zephyrproject-rtos/test_results ( actions: create versioned artifact Signed-off-by: Anas Nashif ) on Shippable.com #builds By Shippable.com ·
[ master ] Build CANCELED for zephyrproject-rtos/test_results ( add merge_junit.py script ) on Shippable.com #builds By Shippable.com ·
[ master ] Build FAILED for zephyrproject-rtos/test_results ( add m2gl025_miv platform ) on Shippable.com 2 messages #builds By Shippable.com ·
[ master ] Build TIMEOUT for zephyrproject-rtos/ci-test ( ci: bump to docker image v0.11.6 Signed-off-by: Kumar Gala ) on Shippable.com 10 messages #builds By Shippable.com ·
[ master ] Build FAILED for zephyrproject-rtos/test_results ( add m2gl025_miv platform ) on Shippable.com #builds By Shippable.com ·