Build fails when the sdk is not installed in the default path in Archlinux.


Yannis Damigos
 

Dear all,

Building the philosophers sample fails when the sdk is not installed under the default path (/opt/zephyr-sdk) in Archlinux with the following error:
make[1]: Entering directory '/home/xekarfwtos/projects/zephyr'
make[2]: Entering directory '/home/xekarfwtos/projects/philosophers/outdir'
Using /home/xekarfwtos/projects/zephyr as source for kernel
GEN ./Makefile
CHK include/generated/version.h
HOSTCC scripts/basic/fixdep
HOSTCC scripts/gen_idt/version.o
HOSTCC scripts/gen_idt/gen_idt.o
HOSTLD scripts/gen_idt/gen_idt
HOSTCC scripts/gen_offset_header/gen_offset_header.o
HOSTLD scripts/gen_offset_header/gen_offset_header
CHK misc/generated/configs.c
UPD misc/generated/configs.c
i586-poky-elf-gcc: error trying to exec 'cc1': execvp: No such file or directory
/home/xekarfwtos/projects/zephyr/./Kbuild:98: recipe for target 'arch/x86/core/offsets/offsets.o' failed
make[3]: *** [arch/x86/core/offsets/offsets.o] Error 1
/home/xekarfwtos/projects/zephyr/Makefile:892: recipe for target 'prepare' failed
make[2]: *** [prepare] Error 2
make[2]: Leaving directory '/home/xekarfwtos/projects/philosophers/outdir'
Makefile:169: recipe for target 'sub-make' failed
make[1]: *** [sub-make] Error 2
make[1]: Leaving directory '/home/xekarfwtos/projects/zephyr'
/home/xekarfwtos/projects/zephyr/Makefile.inc:61: recipe for target 'all' failed
make: *** [all] Error 2

When the sdk is installed under the default path compiling succeeded.

Best regards,
Yannis

Join devel@lists.zephyrproject.org to automatically receive all group messages.