Re: k_poll_signal_raise linker error


Ramakrishna Pallala <ramakrishna.pallala@...>
 

Issue resolved.

 

From: devel@... [mailto:devel@...] On Behalf Of Ramakrishna Pallala
Sent: Thursday, February 28, 2019 2:11 PM
To: devel@...
Subject: [Zephyr-devel] k_poll_signal_raise linker error

 

Hi, is anyone facing following linking error:

 

In function `k_poll_signal_raise':

/home/rpallala/ssg-otc/Zephyr/zephyr-pm/test/zephyr/samples/hello_world/build/zephyr/include/generated/syscalls/kernel.h:141: undefined reference to `_impl_k_poll_signal_raise'

collect2: error: ld returned 1 exit status

zephyr/CMakeFiles/zephyr_prebuilt.dir/build.make:94: recipe for target 'zephyr/zephyr_prebuilt.elf' failed

make[2]: *** [zephyr/zephyr_prebuilt.elf] Error 1

CMakeFiles/Makefile2:452: recipe for target 'zephyr/CMakeFiles/zephyr_prebuilt.dir/all' failed

make[1]: *** [zephyr/CMakeFiles/zephyr_prebuilt.dir/all] Error 2

Makefile:83: recipe for target 'all' failed

 

Thanks,

Ram

Join devel@lists.zephyrproject.org to automatically receive all group messages.